Target
Peroxisome proliferator-activated receptor delta
Ligand
BDBM50383373
Substrate
Meas. Tech.
ChEMBL_2051742 (CHEMBL4706441)
Ki
4.6±n/a nM
Citation
 An, SKim, GKim, HJAhn, SKim, HYKo, HHyun, YENguyen, MJeong, JLiu, ZHan, JChoi, HYu, JKim, JWLee, HWJacobson, KACho, WJKim, YMKang, KWNoh, MJeong, LS Discovery and Structure-Activity Relationships of Novel Template, Truncated 1'-Homologated Adenosine Derivatives as Pure Dual PPAR?/? Modulators. J Med Chem 63:16012-16027 (2020)  
Target
Name:
Peroxisome proliferator-activated receptor delta
Synonyms:
NR1C2 NUCI Nuclear receptor subfamily 1 group C member 2 PPAR-beta PPARD Peroxisome proliferator-activated receptor Peroxisome proliferator-activated receptor delta
Type:
Enzyme
Mol. Mass.:
49910.45
Organism:
Homo sapiens (Human)
Description:
Q03181
Residue:
441
  
Inhibitor
Name:
BDBM50383373
Synonyms:
CHEMBL592652 | GSK0660
Type:
Small organic molecule
Emp. Form.:
C19H18N2O5S2
Mol. Mass.:
418.487
SMILES:
COC(=O)c1sccc1S(=O)(=O)Nc1ccc(Nc2ccccc2)cc1OC
: