Target
Estrogen-related receptor gamma
Ligand
BDBM50555952
Substrate
Meas. Tech.
ChEMBL_2054280 (CHEMBL4709281)
IC50
13±n/a nM
Citation
 Kim, JHwang, HYoon, HLee, JEOh, JMAn, HJi, HDLee, SCha, EMa, MJKim, DSLee, SJKadayat, TMSong, JLee, SWJeon, JHPark, KGLee, IKJeon, YHChin, JCho, SJ An orally available inverse agonist of estrogen-related receptor gamma showed expanded efficacy for the radioiodine therapy of poorly differentiated thyroid cancer. Eur J Med Chem 205:0 (2020)  
Target
Name:
Estrogen-related receptor gamma
Synonyms:
ERR gamma-2 ERR3_HUMAN ESRRG Estrogen-Related Receptor, gamma KIAA0832 Nuclear receptor subfamily 3 group B member 3
Type:
PROTEIN
Mol. Mass.:
51305.00
Organism:
Homo sapiens (Human)
Description:
ChEMBL_1501351
Residue:
458
  
Inhibitor
Name:
BDBM50555952
Synonyms:
CHEMBL4741828
Type:
Small organic molecule
Emp. Form.:
C31H36ClNO2
Mol. Mass.:
490.076
SMILES:
Cl.CC(C)N1CCC(=CC1)c1ccc(cc1)C(=C(\CCCO)c1ccccc1)\c1ccc(O)cc1
: