Target
Mitogen-activated protein kinase kinase kinase 4
Ligand
BDBM50556597
Substrate
Meas. Tech.
ChEMBL_2056725 (CHEMBL4711726)
IC50
5800±n/a nM
Citation
 Röhm, SSchröder, MDwyer, JEWiddowson, CSChaikuad, ABerger, BTJoerger, ACKrämer, AHarbig, JDauch, DKudolo, MLaufer, SBagley, MCKnapp, S Selective targeting of the ?C and DFG-out pocket in p38 MAPK. Eur J Med Chem 208:0 (2020)  
Target
Name:
Mitogen-activated protein kinase kinase kinase 4
Synonyms:
KIAA0213 MAP three kinase 1 MAPK/ERK kinase kinase 4 MEK kinase 4 MEKK4 Mitogen-activated protein kinase kinase kinase 4
Type:
PROTEIN
Mol. Mass.:
181676.15
Organism:
Homo sapiens (Human)
Description:
ChEMBL_774507
Residue:
1608
  
Inhibitor
Name:
BDBM50556597
Synonyms:
CHEMBL4756586
Type:
Small organic molecule
Emp. Form.:
C30H38N6O3
Mol. Mass.:
530.6611
SMILES:
CCNC(=O)[C@H](CCC1CCCCC1)NC(=O)c1ccc(CNC(=O)c2cnn(c2N)-c2ccccc2)cc1
: