Target
Sodium-dependent noradrenaline transporter
Ligand
BDBM50118289
Substrate
Meas. Tech.
ChEMBL_142614 (CHEMBL751152)
Ki
5.2±n/a nM
Citation
 Houlihan, WJAhmad, UFKoletar, JKelly, LBrand, LKopajtic, TA Benzo- and cyclohexanomazindol analogues as potential inhibitors of the cocaine binding site at the dopamine transporter. J Med Chem 45:4110-8 (2002)  
Target
Name:
Sodium-dependent noradrenaline transporter
Synonyms:
Monoamine transporter NET Noradrenaline Transporter (NET) Norepinephrine transporter protein (NET) SLC6A2 Sodium-dependent noradrenaline transporter (NET) | Solute carrier family 6 member 2
Type:
Multi-pass membrane protein
Mol. Mass.:
69337.72
Organism:
Homo sapiens (Human)
Description:
P23975
Residue:
617
  
Inhibitor
Name:
BDBM50118289
Synonyms:
7-Naphthalen-2-yl-8,9-dihydro-7H-7a,10-diaza-pentaleno[1,2-a]naphthalen-7-ol | CHEMBL340281
Type:
Small organic molecule
Emp. Form.:
C24H18N2O
Mol. Mass.:
350.4125
SMILES:
OC1(N2CCN=C2c2c1ccc1ccccc21)c1ccc2ccccc2c1
: