Target
Sodium-dependent dopamine transporter
Ligand
BDBM50118295
Substrate
Meas. Tech.
ChEMBL_61827 (CHEMBL672591)
IC50
34.2±n/a nM
Citation
 Houlihan, WJAhmad, UFKoletar, JKelly, LBrand, LKopajtic, TA Benzo- and cyclohexanomazindol analogues as potential inhibitors of the cocaine binding site at the dopamine transporter. J Med Chem 45:4110-8 (2002)  
Target
Name:
Sodium-dependent dopamine transporter
Synonyms:
DA transporter SC6A3_RAT Sodium-dependent dopamine transporter | Sodium-dependent dopamine transporter (DAT)
Type:
Multi-pass membrane protein
Mol. Mass.:
68749.45
Organism:
Rattus norvegicus (rat)
Description:
P23977
Residue:
619
  
Inhibitor
Name:
BDBM50118295
Synonyms:
11-(4-Chloro-phenyl)-5a,7,8,9,9a,11-hexahydro-6H-benzo[4,5]imidazo[2,1-a]isoindol-11-ol | CHEMBL337020
Type:
Small organic molecule
Emp. Form.:
C20H19ClN2O
Mol. Mass.:
338.831
SMILES:
OC1(N2[C@H]3CCCC[C@@H]3N=C2c2ccccc12)c1ccc(Cl)cc1
: