Target
Sodium-dependent noradrenaline transporter
Ligand
BDBM50118295
Substrate
Meas. Tech.
ChEMBL_142614 (CHEMBL751152)
Ki
690±n/a nM
Citation
 Houlihan, WJAhmad, UFKoletar, JKelly, LBrand, LKopajtic, TA Benzo- and cyclohexanomazindol analogues as potential inhibitors of the cocaine binding site at the dopamine transporter. J Med Chem 45:4110-8 (2002)  
Target
Name:
Sodium-dependent noradrenaline transporter
Synonyms:
Monoamine transporter NET Noradrenaline Transporter (NET) Norepinephrine transporter protein (NET) SLC6A2 Sodium-dependent noradrenaline transporter (NET) | Solute carrier family 6 member 2
Type:
Multi-pass membrane protein
Mol. Mass.:
69337.72
Organism:
Homo sapiens (Human)
Description:
P23975
Residue:
617
  
Inhibitor
Name:
BDBM50118295
Synonyms:
11-(4-Chloro-phenyl)-5a,7,8,9,9a,11-hexahydro-6H-benzo[4,5]imidazo[2,1-a]isoindol-11-ol | CHEMBL337020
Type:
Small organic molecule
Emp. Form.:
C20H19ClN2O
Mol. Mass.:
338.831
SMILES:
OC1(N2[C@H]3CCCC[C@@H]3N=C2c2ccccc12)c1ccc(Cl)cc1
: