Target
Sodium-dependent dopamine transporter
Ligand
BDBM50118294
Substrate
Meas. Tech.
ChEMBL_61827 (CHEMBL672591)
IC50
37.27±n/a nM
Citation
 Houlihan, WJAhmad, UFKoletar, JKelly, LBrand, LKopajtic, TA Benzo- and cyclohexanomazindol analogues as potential inhibitors of the cocaine binding site at the dopamine transporter. J Med Chem 45:4110-8 (2002)  
Target
Name:
Sodium-dependent dopamine transporter
Synonyms:
DA transporter SC6A3_RAT Sodium-dependent dopamine transporter | Sodium-dependent dopamine transporter (DAT)
Type:
Multi-pass membrane protein
Mol. Mass.:
68749.45
Organism:
Rattus norvegicus (rat)
Description:
P23977
Residue:
619
  
Inhibitor
Name:
BDBM50118294
Synonyms:
7-(4-Chloro-phenyl)-7,8,9,10-tetrahydro-7a,11-diaza-benzo[c]fluoren-7-ol | CHEMBL334577
Type:
Small organic molecule
Emp. Form.:
C21H17ClN2O
Mol. Mass.:
348.825
SMILES:
OC1(N2CCCN=C2c2c1ccc1ccccc21)c1ccc(Cl)cc1
: