Target
Sodium-dependent serotonin transporter
Ligand
BDBM50118295
Substrate
Meas. Tech.
ChEMBL_201484 (CHEMBL805241)
Ki
600±n/a nM
Citation
 Houlihan, WJAhmad, UFKoletar, JKelly, LBrand, LKopajtic, TA Benzo- and cyclohexanomazindol analogues as potential inhibitors of the cocaine binding site at the dopamine transporter. J Med Chem 45:4110-8 (2002)  
Target
Name:
Sodium-dependent serotonin transporter
Synonyms:
5-HT Transporter 5HTT SC6A4_HUMAN SLC6A4 Serotonin transporter (5HTT) Sodium-dependent serotonin transporter (SERT) | Solute carrier family 6 member 4
Type:
Multi-pass membrane protein
Mol. Mass.:
70322.51
Organism:
Homo sapiens (Human)
Description:
P31645
Residue:
630
  
Inhibitor
Name:
BDBM50118295
Synonyms:
11-(4-Chloro-phenyl)-5a,7,8,9,9a,11-hexahydro-6H-benzo[4,5]imidazo[2,1-a]isoindol-11-ol | CHEMBL337020
Type:
Small organic molecule
Emp. Form.:
C20H19ClN2O
Mol. Mass.:
338.831
SMILES:
OC1(N2[C@H]3CCCC[C@@H]3N=C2c2ccccc12)c1ccc(Cl)cc1
: