Target
Sodium-dependent dopamine transporter
Ligand
BDBM50118294
Substrate
Meas. Tech.
ChEMBL_61495 (CHEMBL672989)
IC50
2.1±n/a nM
Citation
 Houlihan, WJAhmad, UFKoletar, JKelly, LBrand, LKopajtic, TA Benzo- and cyclohexanomazindol analogues as potential inhibitors of the cocaine binding site at the dopamine transporter. J Med Chem 45:4110-8 (2002)  
Target
Name:
Sodium-dependent dopamine transporter
Synonyms:
DA transporter DAT1 Dopamine transporter protein (DAT) SC6A3_HUMAN Sodium-dependent dopamine transporter Solute carrier family 6 member 3
Type:
Multi-pass membrane protein
Mol. Mass.:
68497.11
Organism:
Homo sapiens (Human)
Description:
Q01959
Residue:
620
  
Inhibitor
Name:
BDBM50118294
Synonyms:
7-(4-Chloro-phenyl)-7,8,9,10-tetrahydro-7a,11-diaza-benzo[c]fluoren-7-ol | CHEMBL334577
Type:
Small organic molecule
Emp. Form.:
C21H17ClN2O
Mol. Mass.:
348.825
SMILES:
OC1(N2CCCN=C2c2c1ccc1ccccc21)c1ccc(Cl)cc1
: