Target
Ribosyldihydronicotinamide dehydrogenase [quinone]
Ligand
BDBM50118438
Substrate
Meas. Tech.
ChEMBL_104940 (CHEMBL714719)
Ki
1190±n/a nM
Citation
 Fukatsu, KUchikawa, OKawada, MYamano, TYamashita, MKato, KHirai, KHinuma, SMiyamoto, MOhkawa, S Synthesis of a novel series of benzocycloalkene derivatives as melatonin receptor agonists. J Med Chem 45:4212-21 (2002)  
Target
Name:
Ribosyldihydronicotinamide dehydrogenase [quinone]
Synonyms:
Metallothionein-3 NQO2 NRH dehydrogenase [quinone] 2 QR2 Quinone reductase 2 (NQO2) | Ribosyldihydronicotinamide dehydrogenase [quinone]
Type:
Protein
Mol. Mass.:
25917.25
Organism:
Homo sapiens (Human)
Description:
P16083
Residue:
231
  
Inhibitor
Name:
BDBM50118438
Synonyms:
(E) N-[2-(6-Methoxy-indan-1-ylidene)-ethyl]-propionamide | CHEMBL133763
Type:
Small organic molecule
Emp. Form.:
C15H19NO2
Mol. Mass.:
245.3169
SMILES:
CCC(=O)NC\C=C1/CCc2ccc(OC)cc12
: