Target
Ribosyldihydronicotinamide dehydrogenase [quinone]
Ligand
BDBM50118457
Substrate
Meas. Tech.
ChEMBL_104940 (CHEMBL714719)
Ki
782±n/a nM
Citation
 Fukatsu, KUchikawa, OKawada, MYamano, TYamashita, MKato, KHirai, KHinuma, SMiyamoto, MOhkawa, S Synthesis of a novel series of benzocycloalkene derivatives as melatonin receptor agonists. J Med Chem 45:4212-21 (2002)  
Target
Name:
Ribosyldihydronicotinamide dehydrogenase [quinone]
Synonyms:
Metallothionein-3 NQO2 NRH dehydrogenase [quinone] 2 QR2 Quinone reductase 2 (NQO2) | Ribosyldihydronicotinamide dehydrogenase [quinone]
Type:
Protein
Mol. Mass.:
25917.25
Organism:
Homo sapiens (Human)
Description:
P16083
Residue:
231
  
Inhibitor
Name:
BDBM50118457
Synonyms:
CHEMBL339840 | N-[2-(5,6-Dimethoxy-indan-1-yl)-ethyl]-acetamide
Type:
Small organic molecule
Emp. Form.:
C15H21NO3
Mol. Mass.:
263.3321
SMILES:
COc1cc2CCC(CCNC(C)=O)c2cc1OC
: