Target
Translocator protein
Ligand
BDBM50118528
Substrate
Meas. Tech.
ChEMBL_37200 (CHEMBL650801)
Ki
0.1±n/a nM
Citation
 Campiani, GRamunno, AFiorini, INacci, VMorelli, ENovellino, EGoegan, MMennini, TSullivan, SZisterer, DMWilliams, CD Synthesis of new molecular probes for investigation of steroid biosynthesis induced by selective interaction with peripheral type benzodiazepine receptors (PBR). J Med Chem 45:4276-81 (2002)  
Target
Name:
Translocator protein
Synonyms:
Benzodiazepine receptors; peripheral & central Mbr PBR Peripheral benzodiazepine receptor (PBR) TSPO_RAT | Tspo
Type:
Mitochondrion membrane protein
Mol. Mass.:
18945.84
Organism:
Rattus norvegicus (rat)
Description:
Competitive binding experiments were performed on rat kidney mitochondrial membranes.
Residue:
169
  
Inhibitor
Name:
BDBM50118528
Synonyms:
CHEMBL135514 | Ethyl-carbamic acid 5-phenyl-6-oxa-10b-aza-benzo[e]azulen-4-yl ester
Type:
Small organic molecule
Emp. Form.:
C21H18N2O3
Mol. Mass.:
346.3792
SMILES:
CCNC(=O)OC1=C(Oc2ccccc2-n2cccc12)c1ccccc1
: