Target
Cathepsin B
Ligand
BDBM50108849
Substrate
Meas. Tech.
ChEMBL_47424 (CHEMBL662611)
Ki
1700±n/a nM
Citation
 Huang, LEllman, JA General solid-phase method to prepare novel cyclic ketone inhibitors of the cysteine protease cruzain. Bioorg Med Chem Lett 12:2993-6 (2002)  
Target
Name:
Cathepsin B
Synonyms:
APP secretase CATB_HUMAN CTSB Cathepsin B light chain | Cathepsin B1
Type:
Enzyme
Mol. Mass.:
37819.69
Organism:
Homo sapiens (Human)
Description:
gi_63102437
Residue:
339
  
Inhibitor
Name:
BDBM50108849
Synonyms:
CHEMBL321974 {3-Methyl-1-[2-oxo-1-phenethyl-3-(3-phenyl-propylsulfanyl)-propylcarbamoyl]-butyl}-carbamic acid pyridin-3-ylmethyl ester
Type:
Small organic molecule
Emp. Form.:
C33H41N3O4S
Mol. Mass.:
575.761
SMILES:
CC(C)C[C@H](NC(=O)OCc1cccnc1)C(=O)N[C@@H](CCc1ccccc1)C(=O)CSCCCc1ccccc1
: