Target
Adenylate cyclase type 5
Ligand
BDBM50119854
Substrate
Meas. Tech.
ChEBML_213257
IC50
102000±n/a nM
Citation
 Levy, DBao, MTomlinson, JScarborough, R Hydroxamate based inhibitors of adenylyl cyclase. Part 2: the effect of cyclic linkers on P-site binding. Bioorg Med Chem Lett 12:3089-92 (2002)  
Target
Name:
Adenylate cyclase type 5
Synonyms:
ADCY5 Adenylate cyclase | Adenylate cyclase type V
Type:
PROTEIN
Mol. Mass.:
138919.21
Organism:
Homo sapiens (Human)
Description:
ChEMBL_31732
Residue:
1261
  
Inhibitor
Name:
BDBM50119854
Synonyms:
2-{[(1R,4S)-4-(6-amino-9H-purin-9-yl)cyclopent-2-en-1-yl]oxy}-N-hydroxyacetamide | CHEMBL105636
Type:
Small organic molecule
Emp. Form.:
C12H14N6O3
Mol. Mass.:
290.278
SMILES:
Nc1ncnc2n(cnc12)[C@H]1C[C@@H](OCC(=O)NO)C=C1
: