Target
Adenylate cyclase type 5
Ligand
BDBM50119832
Substrate
Meas. Tech.
ChEMBL_213257 (CHEMBL821465)
IC50
7900±n/a nM
Citation
 Levy, DBao, MTomlinson, JScarborough, R Hydroxamate based inhibitors of adenylyl cyclase. Part 2: the effect of cyclic linkers on P-site binding. Bioorg Med Chem Lett 12:3089-92 (2002)  
Target
Name:
Adenylate cyclase type 5
Synonyms:
ADCY5 Adenylate cyclase | Adenylate cyclase type V
Type:
PROTEIN
Mol. Mass.:
138919.21
Organism:
Homo sapiens (Human)
Description:
ChEMBL_31732
Residue:
1261
  
Inhibitor
Name:
BDBM50119832
Synonyms:
4-(6-Amino-purin-9-yl)-N-hydroxy-butyramide | CHEMBL302708
Type:
Small organic molecule
Emp. Form.:
C9H12N6O2
Mol. Mass.:
236.2306
SMILES:
Nc1ncnc2n(CCCC(=O)NO)cnc12
: