Target
Adenylate cyclase type 5
Ligand
BDBM50119853
Substrate
Meas. Tech.
ChEBML_213257
IC50
72000±n/a nM
Citation
 Levy, DBao, MTomlinson, JScarborough, R Hydroxamate based inhibitors of adenylyl cyclase. Part 2: the effect of cyclic linkers on P-site binding. Bioorg Med Chem Lett 12:3089-92 (2002)  
Target
Name:
Adenylate cyclase type 5
Synonyms:
ADCY5 Adenylate cyclase | Adenylate cyclase type V
Type:
PROTEIN
Mol. Mass.:
138919.21
Organism:
Homo sapiens (Human)
Description:
ChEMBL_31732
Residue:
1261
  
Inhibitor
Name:
BDBM50119853
Synonyms:
2-{[(1S,4S)-4-(6-amino-9H-purin-9-yl)cyclopent-2-en-1-yl]oxy}acetic acid | CHEMBL322057
Type:
Small organic molecule
Emp. Form.:
C12H13N5O3
Mol. Mass.:
275.2633
SMILES:
Nc1ncnc2n(cnc12)[C@H]1C[C@H](OCC(O)=O)C=C1
: