Target
Chymotrypsin-C
Ligand
BDBM50120298
Substrate
Meas. Tech.
ChEMBL_197808 (CHEMBL802338)
IC50
75.0±n/a nM
Citation
 Priestley, ESDe Lucca, IGhavimi, BErickson-Viitanen, SDecicco, CP P1 Phenethyl peptide boronic acid inhibitors of HCV NS3 protease. Bioorg Med Chem Lett 12:3199-202 (2002)  
Target
Name:
Chymotrypsin-C
Synonyms:
CLCR CTRC_HUMAN Chymotrypsin Chymotrypsin-C
Type:
Enzyme
Mol. Mass.:
29487.98
Organism:
Homo sapiens (Human)
Description:
Q99895
Residue:
268
  
Inhibitor
Name:
BDBM50120298
Synonyms:
CHEMBL109434 | Peptide Boronic Acid analogue
Type:
Small organic molecule
Emp. Form.:
C43H65BN6O11
Mol. Mass.:
852.821
SMILES:
CC(C)[C@H](NC(=O)[C@H](CCC(O)=O)NC(=O)[C@@H](N)CC(O)=O)C(=O)N[C@@H](C(C)C)C(=O)N1CCC[C@@H]1C(=O)N[C@@H](CCc1ccccc1)B1O[C@@H]2C[C@@H]3C[C@@H](C3(C)C)[C@]2(C)O1
: