Target
Gamma-aminobutyric acid receptor subunit alpha-5
Ligand
BDBM50120792
Substrate
Meas. Tech.
ChEMBL_68414 (CHEMBL680330)
EC50
650±n/a nM
Citation
 Albaugh, PAMarshall, LGregory, JWhite, GHutchison, ARoss, PCGallagher, DWTallman, JFCrago, MCassella, JV Synthesis and biological evaluation of 7,8,9,10-tetrahydroimidazo[1,2-c]pyrido[3,4-e]pyrimdin-5(6H)-ones as functionally selective ligands of the benzodiazepine receptor site on the GABA(A) receptor. J Med Chem 45:5043-51 (2002)  
Target
Name:
Gamma-aminobutyric acid receptor subunit alpha-5
Synonyms:
GABA receptor alpha-5 subunit GABRA5 Gamma-aminobutyric acid receptor subunit alpha-5 (GABA(A)) | Gamma-aminobutyric acid receptor subunit alpha-5 (GABAA)
Type:
Enzyme
Mol. Mass.:
52160.59
Organism:
Homo sapiens (Human)
Description:
P31644
Residue:
462
  
Inhibitor
Name:
BDBM50120792
Synonyms:
8-Benzyl-2-p-tolyl-6,7,8,9-tetrahydro-5H-1,3a,5,8-tetraaza-cyclopenta[a]naphthalen-4-one | CHEMBL147312
Type:
Small organic molecule
Emp. Form.:
C23H22N4O
Mol. Mass.:
370.447
SMILES:
Cc1ccc(cc1)-c1cn2c(n1)c1CN(Cc3ccccc3)CCc1[nH]c2=O
: