Target
Cytochrome c oxidase subunit 2
Ligand
BDBM11639
Substrate
Meas. Tech.
ChEMBL_2067170 (CHEMBL4722423)
IC50
280±n/a nM
Citation
 Jan, MSAhmad, SHussain, FAhmad, AMahmood, FRashid, UAbid, OUUllah, FAyaz, MSadiq, A Design, synthesis, in-vitro, in-vivo and in-silico studies of pyrrolidine-2,5-dione derivatives as multitarget anti-inflammatory agents. Eur J Med Chem 186:0 (2020)  
Target
Name:
Cytochrome c oxidase subunit 2
Synonyms:
COII COX2_HUMAN MT-CO2 | MTCO2
Type:
PROTEIN
Mol. Mass.:
25555.66
Organism:
Homo sapiens (Human)
Description:
ChEMBL_530099
Residue:
227
  
Inhibitor
Name:
BDBM11639
Synonyms:
4-[5-(4-methylphenyl)-3-(trifluoromethyl)-1H-pyrazol-1-yl]benzene-1-sulfonamide CLX Celecoxib US11478464, Compound Celecoxib US8741944, Comparative Compound cid_2662
Type:
Small organic molecule
Emp. Form.:
C17H14F3N3O2S
Mol. Mass.:
381.372
SMILES:
Cc1ccc(cc1)-c1cc(nn1-c1ccc(cc1)S(N)(=O)=O)C(F)(F)F
: