Target
Coagulation factor X
Ligand
BDBM50559550
Substrate
Meas. Tech.
ChEMBL_2069766 (CHEMBL4725019)
IC50
0.400000±n/a nM
Citation
 Jun, JJDuscharla, DUmmanni, RHanson, PRMalhotra, SV Investigation on the Anticancer Activity of Symmetric and Unsymmetric Cyclic Sulfamides. ACS Med Chem Lett 12:202-210 (2021)  
Target
Name:
Coagulation factor X
Synonyms:
Activated coagulation factor X (FXa) Coagulation factor X precursor F10 Factor X heavy chain Factor Xa Stuart-Prower factor
Type:
Enzyme
Mol. Mass.:
54726.60
Organism:
Homo sapiens (Human)
Description:
Residue:
488
  
Inhibitor
Name:
BDBM50559550
Synonyms:
CHEMBL4746164
Type:
Small organic molecule
Emp. Form.:
C26H28N6O4S
Mol. Mass.:
520.603
SMILES:
CC(=N)N1CCC(CC1)Oc1ccc2N(Cc3ccc4ccc(cc4c3)C(N)=N)S(=O)(=O)NC(=O)c2c1
: