Target
Retinoic acid receptor RXR-beta
Ligand
BDBM50122348
Substrate
Meas. Tech.
ChEBML_197069
Kd
8±n/a nM
Citation
 Farmer, LJZhi, LJeong, SLamph, WWOsburn, DLCroston, GFlatten, KSHeyman, RANadzan, AM Retinoic acid receptor ligands based on the 6-cyclopropyl-2,4-hexadienoic acid. Bioorg Med Chem Lett 13:261-4 (2002)  
Target
Name:
Retinoic acid receptor RXR-beta
Synonyms:
Nr2b2 Retinoid X receptor beta | Rxrb
Type:
PROTEIN
Mol. Mass.:
55877.78
Organism:
Mus musculus
Description:
ChEMBL_196588
Residue:
520
  
Inhibitor
Name:
BDBM50122348
Synonyms:
(2E,4E)-6-[1-(3,5-Di-tert-butyl-phenyl)-cyclopropyl]-3-methyl-hexa-2,4-dienoic acid | CHEMBL89581
Type:
Small organic molecule
Emp. Form.:
C24H34O2
Mol. Mass.:
354.5256
SMILES:
C\C(\C=C\CC1(CC1)c1cc(cc(c1)C(C)(C)C)C(C)(C)C)=C/C(O)=O
: