Target
Bromodomain-containing protein 2
Ligand
BDBM50560174
Substrate
Meas. Tech.
ChEMBL_2071517 (CHEMBL4727051)
Kd
20±n/a nM
Citation
 Watson, RJBamborough, PBarnett, HChung, CWDavis, RGordon, LGrandi, PPetretich, MPhillipou, APrinjha, RKRioja, ISoden, PWerner, TDemont, EH GSK789: A Selective Inhibitor of the First Bromodomains (BD1) of the Bromo and Extra Terminal Domain (BET) Proteins. J Med Chem 63:9045-9069 (2020)  
Target
Name:
Bromodomain-containing protein 2
Synonyms:
BRD2 Bromodomain and extra-terminal motif (BET) Bromodomain-containing protein 2 (BRD2) RING3
Type:
Protein
Mol. Mass.:
88085.95
Organism:
Homo sapiens (Human)
Description:
P25440
Residue:
801
  
Inhibitor
Name:
BDBM50560174
Synonyms:
GSK789
Type:
Small organic molecule
Emp. Form.:
C26H33N5O3
Mol. Mass.:
463.5719
SMILES:
CN1CC[C@@H](Nc2ncc(-c3ccco3)c3cc(C)c(=O)[nH]c23)[C@@H](C1)C(=O)NC1CCCCC1
: