Target
Gamma-aminobutyric acid receptor subunit alpha-5/beta-3/gamma-2
Ligand
BDBM26266
Substrate
Meas. Tech.
ChEMBL_70706 (CHEMBL685342)
Ki
>10000±n/a nM
Citation
 Selleri, SBruni, FCostagli, CCostanzo, AGuerrini, GCiciani, GGratteri, PBonaccini, CMalmberg Aiello, PBesnard, FRenard, SCosta, BMartini, C Synthesis and benzodiazepine receptor affinity of pyrazolo[1,5-a]pyrimidine derivatives. 3. New 6-(3-thienyl) series as alpha 1 selective ligands. J Med Chem 46:310-3 (2003)  
Target
Name:
Gamma-aminobutyric acid receptor subunit alpha-5/beta-3/gamma-2
Synonyms:
GABA A receptor alpha-5/beta-3/gamma-2 | GABA receptor alpha-5/beta-3/gamma-2 subunit
Type:
Mol. Mass.:
Description:
ASSAY_ID of EBI is 70706
Components:
This complex has 3 components.
Component 1
Name:
Gamma-aminobutyric acid receptor subunit gamma-2
Synonyms:
GBRG2_RAT Gamma-aminobutyric acid receptor subunit gamma-2 (GABA(A) gamma-2)
Type:
Enzyme
Mol. Mass.:
54087.63
Organism:
Rattus norvegicus (Rat)
Description:
P18508
Residue:
466
  
Component 2
Name:
Gamma-aminobutyric acid receptor subunit alpha-5
Synonyms:
GABA A Alpha5Beta2Gamma2 GABA A Alpha5m10Beta2Gamma2 GABA A Alpha5m9Beta2Gamma2 GABA A receptor alpha-5/beta-3/gamma-2 GBRA5_RAT Gabra5 | Gamma-aminobutyric acid receptor subunit alpha-5
Type:
Enzyme Catalytic Domain
Mol. Mass.:
52350.79
Organism:
RAT
Description:
GABA A alpha5 0 RAT::P19969
Residue:
464
  
Component 3
Name:
Gamma-aminobutyric acid receptor subunit beta-3
Synonyms:
GABA receptor beta-3 subunit Gabrb-3 | Gabrb3
Type:
PROTEIN
Mol. Mass.:
54180.66
Organism:
Rattus norvegicus
Description:
EBI_12481
Residue:
473
  
Inhibitor
Name:
BDBM26266
Synonyms:
Ambien Dalparan ZPM Zolpidem tartrate
Type:
Small organic molecule
Emp. Form.:
C19H21N3O
Mol. Mass.:
307.3895
SMILES:
CN(C)C(=O)Cc1c(nc2ccc(C)cn12)-c1ccc(C)cc1
: