Target
Dual specificity protein kinase CLK3
Ligand
BDBM50560703
Substrate
Meas. Tech.
ChEMBL_2072783 (CHEMBL4728317)
Ki
5200±n/a nM
Citation
 Schröder, MBullock, ANFedorov, OBracher, FChaikuad, AKnapp, S DFG-1 Residue Controls Inhibitor Binding Mode and Affinity, Providing a Basis for Rational Design of Kinase Inhibitor Selectivity. J Med Chem 63:10224-10234 (2020)  
Target
Name:
Dual specificity protein kinase CLK3
Synonyms:
CDC2-like kinase 3 (CLK3) CLK3_HUMAN | Dual specificity protein kinase CLK3
Type:
Protein
Mol. Mass.:
73570.11
Organism:
Homo sapiens (Human)
Description:
Residue:
638
  
Inhibitor
Name:
BDBM50560703
Synonyms:
CHEMBL1349996
Type:
Small organic molecule
Emp. Form.:
C13H15NO2S
Mol. Mass.:
249.329
SMILES:
CCN1\C(Sc2ccc(OC)cc12)=C/C(C)=O
: