Target
Ubiquitin-like modifier-activating enzyme ATG7
Ligand
BDBM476126
Substrate
Meas. Tech.
ChEMBL_2074575 (CHEMBL4730109)
IC50
438±n/a nM
Citation
 Huang, SCAdhikari, SBrownell, JECalderwood, EFChouitar, JD'Amore, NREngland, DBFoley, KHarrison, SJLeRoy, PJLok, DLublinsky, AMa, LTMenon, SYang, YZhang, JGould, AE Discovery and optimization of pyrazolopyrimidine sulfamates as ATG7 inhibitors. Bioorg Med Chem 28:0 (2020)  
Target
Name:
Ubiquitin-like modifier-activating enzyme ATG7
Synonyms:
APG7-like ATG12-activating enzyme E1 ATG7 ATG7_HUMAN Ubiquitin-activating enzyme E1-like protein | hAGP7
Type:
PROTEIN
Mol. Mass.:
77955.74
Organism:
Homo sapiens (Human)
Description:
ChEMBL_939703
Residue:
703
  
Inhibitor
Name:
BDBM476126
Synonyms:
US10865208, Compound I-181 | {(2R,3S,5R)-5-[4-amino-3-(isopropylsulfanyl)-1H-pyrazolo[3,4-d]pyrimidin-1- yl]-3-hydroxytetrahydrofuran-2-yl}methyl sulfamate
Type:
Small organic molecule
Emp. Form.:
C13H20N6O5S2
Mol. Mass.:
404.465
SMILES:
CC(C)Sc1nn([C@H]2C[C@H](O)[C@@H](COS(N)(=O)=O)O2)c2ncnc(N)c12
: