Target
Calpain-1 catalytic subunit
Ligand
BDBM50124017
Substrate
Meas. Tech.
ChEMBL_139013 (CHEMBL744609)
IC50
10±n/a nM
Citation
 Inoue, JNakamura, MCui, YSSakai, YSakai, OHill, JRWang, KKYuen, PW Structure-activity relationship study and drug profile of N-(4-fluorophenylsulfonyl)-L-valyl-L-leucinal (SJA6017) as a potent calpain inhibitor. J Med Chem 46:868-71 (2003)  
Target
Name:
Calpain-1 catalytic subunit
Synonyms:
CAN1_HUMAN CAPN1 Calpain-1 (u-Calpain) Calpain1
Type:
Protein
Mol. Mass.:
81880.51
Organism:
Homo sapiens (Human)
Description:
Residue:
714
  
Inhibitor
Name:
BDBM50124017
Synonyms:
CHEMBL168909 | N-(1-Formyl-3-methyl-butyl)-3-methyl-2-(naphthalene-2-sulfonylamino)-butyramide
Type:
Small organic molecule
Emp. Form.:
C21H28N2O4S
Mol. Mass.:
404.523
SMILES:
CC(C)C[C@@H](NC(=O)[C@@H](NS(=O)(=O)c1ccc2ccccc2c1)C(C)C)C=O
: