Target
Cyclin-dependent kinase 3/G1/S-specific cyclin-E1
Ligand
BDBM50561527
Substrate
Meas. Tech.
ChEMBL_2075069 (CHEMBL4730603)
IC50
399±n/a nM
Citation
 Childers, WEElokely, KMAbou-Gharbia, M The Resurrection of Phenotypic Drug Discovery. ACS Med Chem Lett 11:1820-1828 (2020)  
Target
Name:
Cyclin-dependent kinase 3/G1/S-specific cyclin-E1
Synonyms:
CDK3/Cyclin E | CDK3/E
Type:
Protein
Mol. Mass.:
Description:
Components:
This complex has 2 components.
Component 1
Name:
Cyclin-dependent kinase 3
Synonyms:
CDK3 CDK3_HUMAN Cyclin-dependent kinase 3 | Cyclin-dependent kinase 3 (CDK3)
Type:
Enzyme
Mol. Mass.:
35053.88
Organism:
Homo sapiens (Human)
Description:
Q00526
Residue:
305
  
Component 2
Name:
G1/S-specific cyclin-E1
Synonyms:
CCNE CCNE1_HUMAN
Type:
Enzyme Subunit
Mol. Mass.:
47073.17
Organism:
Homo sapiens (Human)
Description:
Residue:
410
  
Inhibitor
Name:
BDBM50561527
Synonyms:
CHEMBL4764481
Type:
Small organic molecule
Emp. Form.:
C17H18N4O3S
Mol. Mass.:
358.415
SMILES:
[H][C@@]12CC[C@@]([H])(C1)[C@H](C2)Nc1nc(N)c(s1)C(=O)c1ccccc1[N+]([O-])=O
: