Target
Estrogen receptor
Ligand
BDBM50102902
Substrate
Meas. Tech.
ChEMBL_67668 (CHEMBL673861)
Ki
0.28±n/a nM
Citation
 Jordan, VC Antiestrogens and selective estrogen receptor modulators as multifunctional medicines. 2. Clinical considerations and new agents. J Med Chem 46:1081-111 (2003)  
Target
Name:
Estrogen receptor
Synonyms:
ER ESR ESR1_HUMAN Estrogen receptor Estrogen receptor (ER-alpha) Estrogen receptor alpha (ER) Nuclear receptor subfamily 3 group A member 1
Type:
Protein
Mol. Mass.:
66230.44
Organism:
Homo sapiens (Human)
Description:
P03372
Residue:
595
  
Inhibitor
Name:
BDBM50102902
Synonyms:
5-[4-(2-Piperidin-1-yl-ethoxy)-phenyl]-5,6-dihydro-benzo[c]phenanthridine-2,8-diol | CHEMBL12987
Type:
Small organic molecule
Emp. Form.:
C30H30N2O3
Mol. Mass.:
466.5708
SMILES:
Oc1ccc-2c(CN(c3ccc(OCCN4CCCCC4)cc3)c3c-2ccc2cc(O)ccc32)c1
: