Target
Beta-3 adrenergic receptor
Ligand
BDBM50126069
Substrate
Meas. Tech.
ChEMBL_39070 (CHEMBL651141)
EC50
0.016000±n/a nM
Citation
 Harada, HHirokawa, YSuzuki, KHiyama, YOue, MKawashima, HYoshida, NFurutani, YKato, S Novel and potent human and rat beta3-adrenergic receptor agonists containing substituted 3-indolylalkylamines. Bioorg Med Chem Lett 13:1301-5 (2003)  
Target
Name:
Beta-3 adrenergic receptor
Synonyms:
ADRB3 ADRB3_HUMAN Beta-2 adrenergic receptor and beta-3 adrenergic receptor Beta-3 adrenoreceptor | adrenergic Beta3
Type:
G Protein-Coupled Receptor (GPCR)
Mol. Mass.:
43534.88
Organism:
Homo sapiens (Human)
Description:
Residue:
408
  
Inhibitor
Name:
BDBM50126069
Synonyms:
(3-{2-[(R)-2-((R)-3-Chloro-phenyl)-2-hydroxy-ethylamino]-propyl}-1H-indol-7-yloxy)-acetic acid | CHEMBL279260
Type:
Small organic molecule
Emp. Form.:
C21H23ClN2O4
Mol. Mass.:
402.871
SMILES:
C[C@H](Cc1c[nH]c2c(OCC(O)=O)cccc12)NC[C@H](O)c1cccc(Cl)c1
: