Target
Beta-3 adrenergic receptor
Ligand
BDBM50002133
Substrate
Meas. Tech.
ChEMBL_39070 (CHEMBL651141)
EC50
0.095000±n/a nM
Citation
 Harada, HHirokawa, YSuzuki, KHiyama, YOue, MKawashima, HYoshida, NFurutani, YKato, S Novel and potent human and rat beta3-adrenergic receptor agonists containing substituted 3-indolylalkylamines. Bioorg Med Chem Lett 13:1301-5 (2003)  
Target
Name:
Beta-3 adrenergic receptor
Synonyms:
ADRB3 ADRB3_HUMAN Beta-2 adrenergic receptor and beta-3 adrenergic receptor Beta-3 adrenoreceptor | adrenergic Beta3
Type:
G Protein-Coupled Receptor (GPCR)
Mol. Mass.:
43534.88
Organism:
Homo sapiens (Human)
Description:
Residue:
408
  
Inhibitor
Name:
BDBM50002133
Synonyms:
(+/-)-2-(4-((R)-2-((R)-2-(3-chlorophenyl)-2-hydroxyethylamino)propyl)phenoxy)acetic acid (4-{2-[(R)-2-((R)-3-Chloro-phenyl)-2-hydroxy-ethylamino]-propyl}-phenoxy)-acetic acid (BRL 37,344)(4-{2-[2-(3-Chloro-phenyl)-2-hydroxy-ethylamino]-propyl}-phenoxy)-acetic acid 2-(4-((R)-2-((R)-2-(3-chlorophenyl)-2-hydroxyethylamino)propyl)phenoxy)acetic acid CHEMBL284782
Type:
Small organic molecule
Emp. Form.:
C19H22ClNO4
Mol. Mass.:
363.835
SMILES:
C[C@H](Cc1ccc(OCC(O)=O)cc1)NC[C@H](O)c1cccc(Cl)c1
: