Target
Adenosine receptor A2a
Ligand
BDBM50563130
Substrate
Meas. Tech.
ChEMBL_2081575 (CHEMBL4737366)
Ki
3.6±n/a nM
Citation
 Renk, DRSkraban, MBier, DSchulze, AWabbals, EWedekind, FNeumaier, FNeumaier, BHolschbach, M Design, synthesis and biological evaluation of Tozadenant analogues as adenosine A Eur J Med Chem 214:0 (2021)  
Target
Name:
Adenosine receptor A2a
Synonyms:
A2A adenosine receptor (hA2A) ADENOSINE A2 ADORA2 Adenosine A2A receptor (A2AAR)
Type:
G Protein-Coupled Receptor (GPCR)
Mol. Mass.:
44716.46
Organism:
Homo sapiens (Human)
Description:
P29274
Residue:
412
  
Inhibitor
Name:
BDBM50563130
Synonyms:
CHEMBL4753657
Type:
Small organic molecule
Emp. Form.:
C19H25FN4O3S
Mol. Mass.:
408.49
SMILES:
COc1ccc(N2CCOCC2)c2sc(NC(=O)N3CCC(CF)CC3)nc12
: