Target
Adenosine receptor A2a
Ligand
BDBM50563131
Substrate
Meas. Tech.
ChEMBL_2081575 (CHEMBL4737366)
Ki
24±n/a nM
Citation
 Renk, DRSkraban, MBier, DSchulze, AWabbals, EWedekind, FNeumaier, FNeumaier, BHolschbach, M Design, synthesis and biological evaluation of Tozadenant analogues as adenosine A Eur J Med Chem 214:0 (2021)  
Target
Name:
Adenosine receptor A2a
Synonyms:
A2A adenosine receptor (hA2A) ADENOSINE A2 ADORA2 Adenosine A2A receptor (A2AAR)
Type:
G Protein-Coupled Receptor (GPCR)
Mol. Mass.:
44716.46
Organism:
Homo sapiens (Human)
Description:
P29274
Residue:
412
  
Inhibitor
Name:
BDBM50563131
Synonyms:
CHEMBL4748372
Type:
Small organic molecule
Emp. Form.:
C20H27FN4O4S
Mol. Mass.:
438.516
SMILES:
COc1ccc(N2CCOCC2)c2sc(NC(=O)N3CCC(CC3)OCCF)nc12
: