Target
Adenosine receptor A2a
Ligand
BDBM50563134
Substrate
Meas. Tech.
ChEMBL_2081575 (CHEMBL4737366)
Ki
2.8±n/a nM
Citation
 Renk, DRSkraban, MBier, DSchulze, AWabbals, EWedekind, FNeumaier, FNeumaier, BHolschbach, M Design, synthesis and biological evaluation of Tozadenant analogues as adenosine A Eur J Med Chem 214:0 (2021)  
Target
Name:
Adenosine receptor A2a
Synonyms:
A2A adenosine receptor (hA2A) ADENOSINE A2 ADORA2 Adenosine A2A receptor (A2AAR)
Type:
G Protein-Coupled Receptor (GPCR)
Mol. Mass.:
44716.46
Organism:
Homo sapiens (Human)
Description:
P29274
Residue:
412
  
Inhibitor
Name:
BDBM50563134
Synonyms:
CHEMBL4746388
Type:
Small organic molecule
Emp. Form.:
C19H25FN4O4S
Mol. Mass.:
424.49
SMILES:
COc1ccc(N2CCOCC2)c2sc(NC(=O)N3CCC(O)(CF)CC3)nc12
: