Target
Adenosine receptor A2a
Ligand
BDBM50563128
Substrate
Meas. Tech.
ChEMBL_2081576 (CHEMBL4737367)
Ki
19±n/a nM
Citation
 Renk, DRSkraban, MBier, DSchulze, AWabbals, EWedekind, FNeumaier, FNeumaier, BHolschbach, M Design, synthesis and biological evaluation of Tozadenant analogues as adenosine A Eur J Med Chem 214:0 (2021)  
Target
Name:
Adenosine receptor A2a
Synonyms:
AA2AR_RAT Adenosine A2 receptor Adenosine Receptors A2a (A2a) Adenosine receptors A2a Rat striatal adenosine A2a receptor
Type:
G Protein-Coupled Receptor (GPCR)
Mol. Mass.:
45015.65
Organism:
Rattus norvegicus (rat)
Description:
Rat A2A receptors expressed in CHO cells.
Residue:
410
  
Inhibitor
Name:
BDBM50563128
Synonyms:
CHEMBL4783723
Type:
Small organic molecule
Emp. Form.:
C18H23FN4O3S
Mol. Mass.:
394.464
SMILES:
COc1ccc(N2CCOCC2)c2sc(NC(=O)N3CCC(F)CC3)nc12
: