Target
Relaxin receptor 1
Ligand
BDBM50563230
Substrate
Meas. Tech.
ChEMBL_2081744 (CHEMBL4737535)
Ki
1.1±n/a nM
Citation
 Mallart, SIngenito, RBianchi, EBresciani, AEsposito, SGallo, MMagotti, PMonteagudo, EOrsatti, LRoversi, DSantoprete, ATucci, FVeneziano, MBartsch, RBoehm, CBrasseur, DBruneau, PCorbier, AFroissant, JGauzy-Lazo, LGervat, VMarguet, FMenguy, IMinoletti, CNicolas, MFPasquier, OPoirier, BRaux, ARiva, LJaniak, PStrobel, HDuclos, OIlliano, S Identification of Potent and Long-Acting Single-Chain Peptide Mimetics of Human Relaxin-2 for Cardiovascular Diseases. J Med Chem 64:2139-2150 (2021)  
Target
Name:
Relaxin receptor 1
Synonyms:
LGR7 RXFP1 Relaxin family peptide receptor 1
Type:
PROTEIN
Mol. Mass.:
86990.83
Organism:
Homo sapiens (Human)
Description:
ChEMBL_818426
Residue:
757
  
Inhibitor
Name:
BDBM50563230
Synonyms:
CHEMBL4754949
Type:
Small organic molecule
Emp. Form.:
C253H407N73O72S8
Mol. Mass.:
5879.905
SMILES:
CC[C@H](C)[C@H](NC(=O)[C@@H](NC(=O)[C@H](CCC(O)=O)NC(=O)[C@H](CCC(O)=O)NC(=O)[C@H](CCSC)NC(=O)[C@H](Cc1c[nH]c2ccccc12)NC(=O)[C@H](CO)NC(=O)[C@@H](N)CC(O)=O)C(C)C)C(=O)N[C@@H](CCCCN)C(=O)N[C@@H](CC(C)C)C(=O)N[C@H]1CSSC[C@@H]2NC(=O)[C@H](CSCCSC[C@H](NC(=O)CNC(=O)[C@@H](NC(=O)[C@H](Cc3cnc[nH]3)NC2=O)C(C)C)C(=O)N[C@@H]([C@@H](C)O)C(=O)N[C@@H](CCCCN)C(=O)N[C@@H](CCCNC(N)=N)C(=O)N[C@@H](CO)C(=O)N[C@@H](CC(C)C)C(=O)N[C@@H](C)C(=O)N[C@@H](CCCNC(N)=N)C(=O)N[C@@H](Cc2ccccc2)C(=O)NC(CSSC[C@H](NC(=O)[C@@H](NC(=O)[C@H](C)NC(=O)[C@@H](NC(=O)[C@H](CCC(N)=O)NC(=O)[C@H](C)NC(=O)[C@H](CCCNC(N)=N)NC(=O)[C@@H](NC(=O)[C@H](CC(C)C)NC(=O)[C@H](CCC(O)=O)NC(=O)[C@H](CCCNC(N)=N)NC(=O)CNC1=O)C(C)C)[C@@H](C)CC)[C@@H](C)CC)C(=O)NCC(=O)N[C@@H](CCSC)C(=O)N[C@@H](CO)C(=O)N[C@@H]([C@@H](C)O)C(=O)N[C@@H](Cc1c[nH]c2ccccc12)C(=O)N[C@@H](CO)C(O)=O)C(O)=O)NC(=O)[C@H](CCCCN)NC(=O)[C@H](CC(N)=O)NC(=O)[C@H](C)NC(=O)[C@H](CC(C)C)NC(=O)[C@H](C)NC(=O)[C@H](CO)NC(=O)[C@H](Cc1ccc(O)cc1)NC(=O)[C@@H](N)CC(C)C
: