Target
Cyclin-C
Ligand
BDBM50563311
Substrate
Meas. Tech.
ChEMBL_2081913 (CHEMBL4737704)
Ki
22±n/a nM
Citation
 Yu, MTeo, TYang, YLi, MLong, YPhilip, SNoll, BHeinemann, GKDiab, SEldi, PMekonnen, LAnshabo, ATRahaman, MHMilne, RHayball, JDWang, S Potent and orally bioavailable CDK8 inhibitors: Design, synthesis, structure-activity relationship analysis and biological evaluation. Eur J Med Chem 214:0 (2021)  
Target
Name:
Cyclin-C
Synonyms:
CCNC Cyclin C hSRB11
Type:
PROTEIN
Mol. Mass.:
33244.88
Organism:
Homo sapiens (Human)
Description:
ChEMBL_107900
Residue:
283
  
Inhibitor
Name:
BDBM50563311
Synonyms:
CHEMBL4757811
Type:
Small organic molecule
Emp. Form.:
C24H24ClN3O
Mol. Mass.:
405.92
SMILES:
Cc1ccc(-c2cncc(Cl)c2N2CCC3(CCNC3=O)CC2)c2ccccc12
: