Target
Cyclin-C
Ligand
BDBM50563319
Substrate
Meas. Tech.
ChEMBL_2081913 (CHEMBL4737704)
Ki
56±n/a nM
Citation
 Yu, MTeo, TYang, YLi, MLong, YPhilip, SNoll, BHeinemann, GKDiab, SEldi, PMekonnen, LAnshabo, ATRahaman, MHMilne, RHayball, JDWang, S Potent and orally bioavailable CDK8 inhibitors: Design, synthesis, structure-activity relationship analysis and biological evaluation. Eur J Med Chem 214:0 (2021)  
Target
Name:
Cyclin-C
Synonyms:
CCNC Cyclin C hSRB11
Type:
PROTEIN
Mol. Mass.:
33244.88
Organism:
Homo sapiens (Human)
Description:
ChEMBL_107900
Residue:
283
  
Inhibitor
Name:
BDBM50563319
Synonyms:
CHEMBL4800101
Type:
Small organic molecule
Emp. Form.:
C21H21ClN4O
Mol. Mass.:
380.871
SMILES:
Clc1cncc(-c2c[nH]c3ccccc23)c1N1CCC2(CCNC2=O)CC1
: