Target
72 kDa type IV collagenase
Ligand
BDBM50563342
Substrate
Meas. Tech.
ChEMBL_2082102 (CHEMBL4737893)
Ki
0.087000±n/a nM
Citation
 Lenci, EAngeli, ACalugi, LInnocenti, RCarta, FSupuran, CTTrabocchi, A Multitargeting application of proline-derived peptidomimetics addressing cancer-related human matrix metalloproteinase 9 and carbonic anhydrase II. Eur J Med Chem 214:0 (2021)  
Target
Name:
72 kDa type IV collagenase
Synonyms:
72 kDa gelatinase CLG4A Gelatinase A (MMP-2) MMP2_HUMAN Matrix metalloproteinase-2 (MMP 2) Matrix metalloproteinases 2 (MMP-2) | TBE-1
Type:
Enzyme
Mol. Mass.:
73870.36
Organism:
Homo sapiens (Human)
Description:
P08253
Residue:
660
  
Inhibitor
Name:
BDBM50563342
Synonyms:
CHEMBL4797032
Type:
Small organic molecule
Emp. Form.:
C18H18N4O7S
Mol. Mass.:
434.423
SMILES:
ONC(=O)[C@H]1CCCN1S(=O)(=O)c1ccc(NC(=O)c2ccc(cc2)[N+]([O-])=O)cc1
: