Target
Muscarinic acetylcholine receptor M4
Ligand
BDBM46858
Substrate
Meas. Tech.
ChEMBL_139123 (CHEMBL749861)
Ki
60000±n/a nM
Citation
 Kim, MGBodor, ETWang, CHarden, TKKohn, H C(8) substituted 1-azabicyclo[3.3.1]non-3-enes and C(8) substituted 1-azabicyclo[3.3.1]nonan-4-ones: novel muscarinic receptor antagonists. J Med Chem 46:2216-26 (2003)  
Target
Name:
Muscarinic acetylcholine receptor M4
Synonyms:
ACM4_HUMAN Cholinergic, muscarinic M4 Muscarinic acetylcholine receptor M2 and M4
Type:
Enzyme Catalytic Domain
Mol. Mass.:
53079.31
Organism:
Homo sapiens (Human)
Description:
Cholinergic, muscarinic M4 CHRM4 HUMAN M3::P08173
Residue:
479
  
Inhibitor
Name:
BDBM46858
Synonyms:
1-methyl-3,6-dihydro-2H-pyridine-5-carboxylic acid methyl ester;hydrobromide ARECOLINE HYDROBROMIDE SMR000058258 cid_9301 | methyl 1-methyl-3,6-dihydro-2H-pyridine-5-carboxylate;hydrobromide
Type:
Small organic molecule
Emp. Form.:
C8H13NO2
Mol. Mass.:
155.1943
SMILES:
COC(=O)C1=CCCN(C)C1
: