Target
Methionine synthase
Ligand
BDBM50564145
Substrate
Meas. Tech.
ChEMBL_2086764 (CHEMBL4768027)
IC50
12100±n/a nM
Citation
 Wang, MTian, CXue, LLi, HCong, JFang, FYang, JYuan, MChen, YGuo, YWang, XLiu, JZhang, Z Design, synthesis and biological activity of N Eur J Med Chem 190:0 (2020)  
Target
Name:
Methionine synthase
Synonyms:
5-methyltetrahydrofolate--homocysteine methyltransferase MS Vitamin-B12 dependent methionine synthase
Type:
PROTEIN
Mol. Mass.:
140503.96
Organism:
Homo sapiens (Human)
Description:
ChEMBL_854111
Residue:
1265
  
Inhibitor
Name:
BDBM50564145
Synonyms:
CHEMBL4778495
Type:
Small organic molecule
Emp. Form.:
C19H24ClN5O
Mol. Mass.:
373.88
SMILES:
CCc1ccc(CCC2CCc3nc(N)nc(N)c3N2C(=O)CCl)cc1
: