Target
Methionine synthase
Ligand
BDBM50564146
Substrate
Meas. Tech.
ChEMBL_2086764 (CHEMBL4768027)
IC50
45900±n/a nM
Citation
 Wang, MTian, CXue, LLi, HCong, JFang, FYang, JYuan, MChen, YGuo, YWang, XLiu, JZhang, Z Design, synthesis and biological activity of N Eur J Med Chem 190:0 (2020)  
Target
Name:
Methionine synthase
Synonyms:
5-methyltetrahydrofolate--homocysteine methyltransferase MS Vitamin-B12 dependent methionine synthase
Type:
PROTEIN
Mol. Mass.:
140503.96
Organism:
Homo sapiens (Human)
Description:
ChEMBL_854111
Residue:
1265
  
Inhibitor
Name:
BDBM50564146
Synonyms:
CHEMBL4777807
Type:
Small organic molecule
Emp. Form.:
C20H26ClN5O
Mol. Mass.:
387.906
SMILES:
CC(C)c1ccc(CCC2CCc3nc(N)nc(N)c3N2C(=O)CCl)cc1
: