Target
Tyrosine-protein phosphatase non-receptor type 5
Ligand
BDBM50250606
Substrate
Meas. Tech.
ChEMBL_2086947 (CHEMBL4768210)
Ki
110±n/a nM
Citation
 Hou, XSun, JPGe, LLiang, XLi, KZhang, YFang, H Inhibition of striatal-enriched protein tyrosine phosphatase by targeting computationally revealed cryptic pockets. Eur J Med Chem 190:0 (2020)  
Target
Name:
Tyrosine-protein phosphatase non-receptor type 5
Synonyms:
PTN5_HUMAN Tyrosine-protein phosphatase non-receptor type 5 | Tyrosine-protein phosphatase non-receptor type 5 isoform a
Type:
Enzyme Catalytic Domain
Mol. Mass.:
63510.68
Organism:
Homo sapiens (Human)
Description:
gi_90652859
Residue:
565
  
Inhibitor
Name:
BDBM50250606
Synonyms:
CHEMBL4077342
Type:
Small organic molecule
Emp. Form.:
C24H21Cl3F2NO6PS
Mol. Mass.:
626.821
SMILES:
OP(O)(=O)C(F)(c1ccc(cc1)-c1cccc(Cc2cc(Cl)c(Cl)cc2Cl)c1F)S(=O)(=O)N1CCOCC1
: