Target
Calcium-activated potassium channel subunit alpha-1
Ligand
BDBM50128980
Substrate
Meas. Tech.
ChEBML_39096
EC50
8120.0±n/a nM
Citation
 Turner, SCCarroll, WAWhite, TKGopalakrishnan, MCoghlan, MJShieh, CCZhang, XFParihar, ASBuckner, SAMilicic, ISullivan, JP The discovery of a new class of large-conductance Ca2+-activated K+ channel opener targeted for overactive bladder: synthesis and structure-activity relationships of 2-amino-4-azaindoles. Bioorg Med Chem Lett 13:2003-7 (2003)  
Target
Name:
Calcium-activated potassium channel subunit alpha-1
Synonyms:
Calcium-activated potassium channel alpha/beta 1 KCNMA Large conductance calcium-activated potassium channel subfamily M alpha member 1 isoform b | SLO
Type:
PROTEIN
Mol. Mass.:
137567.62
Organism:
Homo sapiens (Human)
Description:
ChEMBL_938830
Residue:
1236
  
Inhibitor
Name:
BDBM50128980
Synonyms:
2-Pyrrolidin-1-yl-1H-pyrrolo[3,2-b]pyridine-3-carbonitrile | CHEMBL64276
Type:
Small organic molecule
Emp. Form.:
C12H12N4
Mol. Mass.:
212.2505
SMILES:
N#Cc1c([nH]c2cccnc12)N1CCCC1
: