Target
Bone morphogenetic protein 1
Ligand
BDBM50129205
Substrate
Meas. Tech.
ChEBML_158890
Ki
410±n/a nM
Citation
 Delaet, NGRobinson, LAWilson, DMSullivan, RWBradley, EKDankwardt, SMMartin, RLVan Wart, HEWalker, KA Novel inhibitors of procollagen C-terminal proteinase. Part 1: diamino Acid hydroxamates. Bioorg Med Chem Lett 13:2101-4 (2003)  
Target
Name:
Bone morphogenetic protein 1
Synonyms:
BMP-1 BMP1_HUMAN PCOLC Procollagen C-proteinase | mTld
Type:
PROTEIN
Mol. Mass.:
111254.03
Organism:
Homo sapiens (Human)
Description:
ChEMBL_518962
Residue:
986
  
Inhibitor
Name:
BDBM50129205
Synonyms:
2-[Benzo[1,3]dioxol-5-ylmethyl-((R)-4-methoxy-benzenesulfonyl)-amino]-4-(3-1H-benzoimidazol-2-yl-propionylamino)-N-hydroxy-butyramide | CHEMBL292336
Type:
Small organic molecule
Emp. Form.:
C29H31N5O8S
Mol. Mass.:
609.65
SMILES:
COc1ccc(cc1)S(=O)(=O)N(Cc1ccc2OCOc2c1)[C@H](CCNC(=O)CCc1nc2ccccc2[nH]1)C(=O)NO
: