Target
Bone morphogenetic protein 1
Ligand
BDBM50102996
Substrate
Meas. Tech.
ChEBML_158890
Ki
100±n/a nM
Citation
 Delaet, NGRobinson, LAWilson, DMSullivan, RWBradley, EKDankwardt, SMMartin, RLVan Wart, HEWalker, KA Novel inhibitors of procollagen C-terminal proteinase. Part 1: diamino Acid hydroxamates. Bioorg Med Chem Lett 13:2101-4 (2003)  
Target
Name:
Bone morphogenetic protein 1
Synonyms:
BMP-1 BMP1_HUMAN PCOLC Procollagen C-proteinase | mTld
Type:
PROTEIN
Mol. Mass.:
111254.03
Organism:
Homo sapiens (Human)
Description:
ChEMBL_518962
Residue:
986
  
Inhibitor
Name:
BDBM50102996
Synonyms:
CHEMBL62908 N-{4-[Benzo[1,3]dioxol-5-ylmethyl-((R)-4-methoxy-benzenesulfonyl)-amino]-4-hydroxycarbamoyl-butyl}-benzamide
Type:
Small organic molecule
Emp. Form.:
C27H29N3O8S
Mol. Mass.:
555.599
SMILES:
COc1ccc(cc1)S(=O)(=O)N(Cc1ccc2OCOc2c1)[C@H](CCCNC(=O)c1ccccc1)C(=O)NO
: