Target
Bone morphogenetic protein 1
Ligand
BDBM50129218
Substrate
Meas. Tech.
ChEBML_158890
Ki
470±n/a nM
Citation
 Delaet, NGRobinson, LAWilson, DMSullivan, RWBradley, EKDankwardt, SMMartin, RLVan Wart, HEWalker, KA Novel inhibitors of procollagen C-terminal proteinase. Part 1: diamino Acid hydroxamates. Bioorg Med Chem Lett 13:2101-4 (2003)  
Target
Name:
Bone morphogenetic protein 1
Synonyms:
BMP-1 BMP1_HUMAN PCOLC Procollagen C-proteinase | mTld
Type:
PROTEIN
Mol. Mass.:
111254.03
Organism:
Homo sapiens (Human)
Description:
ChEMBL_518962
Residue:
986
  
Inhibitor
Name:
BDBM50129218
Synonyms:
4-[({3-[Benzo[1,3]dioxol-5-ylmethyl-((R)-4-methoxy-benzenesulfonyl)-amino]-3-hydroxycarbamoyl-propylcarbamoyl}-methyl)-amino]-cyclohexanecarboxylic acid ethyl ester | CHEMBL67340
Type:
Small organic molecule
Emp. Form.:
C30H40N4O10S
Mol. Mass.:
648.724
SMILES:
CCOC(=O)C1CCC(CC1)NCC(=O)NCC[C@@H](N(Cc1ccc2OCOc2c1)S(=O)(=O)c1ccc(OC)cc1)C(=O)NO
: