Target
Nucleotide-binding oligomerization domain-containing protein 2
Ligand
BDBM50564980
Substrate
Meas. Tech.
ChEMBL_2089822 (CHEMBL4771085)
IC50
323±n/a nM
Citation
 Suebsuwong, CDai, BPinkas, DMDuddupudi, ALLi, LBufton, JCSchlicher, LGyrd-Hansen, MHu, MBullock, ANDegterev, ACuny, GD Receptor-interacting protein kinase 2 (RIPK2) and nucleotide-binding oligomerization domain (NOD) cell signaling inhibitors based on a 3,5-diphenyl-2-aminopyridine scaffold. Eur J Med Chem 200:0 (2020)  
Target
Name:
Nucleotide-binding oligomerization domain-containing protein 2
Synonyms:
CARD15 IBD1 NOD2 Nucleotide-binding oligomerization domain-containing protein 2 | nucleotide-binding oligomerization domain containing 2
Type:
PROTEIN
Mol. Mass.:
115287.18
Organism:
Homo sapiens (Human)
Description:
ChEMBL_1454053
Residue:
1040
  
Inhibitor
Name:
BDBM50564980
Synonyms:
CHEMBL4792496
Type:
Small organic molecule
Emp. Form.:
C27H35N5O3S
Mol. Mass.:
509.664
SMILES:
CC(C)Oc1cc(NS(=O)(=O)C(C)C)cc(c1)-c1cc(cnc1N)-c1ccc(cc1)N1CCNCC1
: