Target
Synaptic vesicular amine transporter
Ligand
BDBM50026188
Substrate
Meas. Tech.
ChEMBL_213570 (CHEMBL816126)
Ki
40300±n/a nM
Citation
 Perera, RPWimalasena, DSWimalasena, K Characterization of a series of 3-amino-2-phenylpropene derivatives as novel bovine chromaffin vesicular monoamine transporter inhibitors. J Med Chem 46:2599-605 (2003)  
Target
Name:
Synaptic vesicular amine transporter
Synonyms:
Monoamine transporter Solute carrier family 18 member 2 VMAT2 Vesicular amine transporter 2
Type:
PROTEIN
Mol. Mass.:
55749.95
Organism:
Bos taurus
Description:
ChEMBL_469572
Residue:
517
  
Inhibitor
Name:
BDBM50026188
Synonyms:
2-Phenyl-allylamine | CHEMBL89394
Type:
Small organic molecule
Emp. Form.:
C9H11N
Mol. Mass.:
133.1903
SMILES:
NCC(=C)c1ccccc1
: