Target
Gap junction beta-2 protein
Ligand
BDBM50565241
Substrate
Meas. Tech.
ChEMBL_2091062 (CHEMBL4772325)
IC50
66700±n/a nM
Citation
 Subedi, YPKjellgren, ARoberts, PMontgomery, HThackeray, NFiori, MCAltenberg, GAChang, CT Amphiphilic aminoglycosides with increased selectivity for inhibition of connexin 43 (Cx43) hemichannels. Eur J Med Chem 203:0 (2020)  
Target
Name:
Gap junction beta-2 protein
Synonyms:
CXB2_HUMAN Cx26 Gap junction beta-2 protein
Type:
PROTEIN
Mol. Mass.:
26226.37
Organism:
Homo sapiens
Description:
ChEMBL_117983
Residue:
226
  
Inhibitor
Name:
BDBM50565241
Synonyms:
CHEMBL4795796
Type:
Small organic molecule
Emp. Form.:
C30H58N4O12
Mol. Mass.:
666.8011
SMILES:
[H][C@]1(O[C@H]2[C@H](N)C[C@H](N)[C@@H](O[C@@]3([H])O[C@H](CNC(=O)CCCCCCCCCCC)[C@@H](O)[C@H](O)[C@H]3O)[C@@H]2O)O[C@H](CO)[C@@H](O)[C@H](N)[C@H]1O
: