Target
Nucleotide-binding oligomerization domain-containing protein 2
Ligand
BDBM50565443
Substrate
Meas. Tech.
ChEMBL_2091819 (CHEMBL4773082)
IC50
480±n/a nM
Citation
 Ma, YLi, XPei, YYe, JWei, XYang, JSi, GTian, JDong, YLiu, G Identification of benzofused five-membered sultams, potent dual NOD1/NOD2 antagonists in vitro and in vivo. Eur J Med Chem 204:0 (2020)  
Target
Name:
Nucleotide-binding oligomerization domain-containing protein 2
Synonyms:
CARD15 IBD1 NOD2 Nucleotide-binding oligomerization domain-containing protein 2 | nucleotide-binding oligomerization domain containing 2
Type:
PROTEIN
Mol. Mass.:
115287.18
Organism:
Homo sapiens (Human)
Description:
ChEMBL_1454053
Residue:
1040
  
Inhibitor
Name:
BDBM50565443
Synonyms:
CHEMBL4792557
Type:
Small organic molecule
Emp. Form.:
C22H22F3NO5S
Mol. Mass.:
469.474
SMILES:
CCCCOC(=O)CC1N(C(=O)c2ccccc2C(F)(F)F)S(=O)(=O)c2c1cccc2C
: